{"text_format":"1","workbook":"xlsx","n_sheets":11,"sheets":["QuotationTool","Lists","Sheet1","AfyaImaraJunior","PricingTable","BenefitsSchedule","BenefitsLookup","AfyaImara","AfyaImaraCounty","AfyaImaraSeniors","AfyaImaraExecutive"],"not_rendered":{"charts":0,"images":2,"macros":1,"external_links":0,"defined_names":2,"comments":0,"pivot_tables":0},"unopened":[],"bounds":{"document_bytes":16777216,"sheet_cells":100000,"rows_first":2000,"rows_last":500,"rows_between":2000,"halvings":0,"cell_chars":16384,"cell_head_chars":4096},"cells_cut":0,"cells_raw":0,"read":"whole","date_system":"1900"}

{"sheet":"QuotationTool","index":0,"n_rows":49,"n_cols":10,"rows_kept":49,"cut":false,"hidden":false,"merged":[[31,2,31,4],[5,2,5,4],[0,4,3,9],[48,5,48,6],[4,2,4,8],[4,9,7,9],[13,3,13,5],[13,0,13,2],[13,6,13,9],[9,0,9,1],[44,0,44,1],[45,0,45,1],[34,0,34,1],[44,2,44,5],[45,2,45,5],[29,7,29,8],[9,3,9,4],[10,3,10,4],[11,3,11,4],[17,3,17,4],[12,3,12,4],[14,0,14,9],[10,6,10,9]]}
[null,null,null,null,"Old Mutual General Insurance Kenya Ltd,\nOld Mutual Tower| Upper Hill Road | PO Box 43013 | Nairobi 00100, Kenya \nTel + 254 2850 000 | Office Cell 0711 065 000 |\nWebsite www.oldmutual.co.ke \n"]
[]
[]
[]
[null,"Attn:","ABSOLOM IRUNGU",null,null,null,null,null,null,"[ Page 1/2 of Quotation ]"]
[null,"Date",{"$f":"TODAY()","v":"2025-04-07"}]
[]
[null,"RE:","AfyaImara",{"$f":"IF(OR(C8=Lists!B4,C8=Lists!B5,C8=Lists!B6,C8=Lists!B8),\"Family Cover\",\"Children Cover\")","v":"Family Cover"}]
[]
["Cover Scope",null,"Inpatient",10000000,null,{"$f":"IFERROR(VLOOKUP(D10,Lists!$I$5:$J$33,2,FALSE),\"Limit not Available\")","v":"    Per Family Per Annum"}]
{"$rows_left_out":40}
{"sheet":"Lists","index":1,"n_rows":63,"n_cols":33,"rows_kept":63,"cut":false,"hidden":true,"merged":[]}
[]
[null,null,null,null,null,null,null,null,null,null,null,null,null,null,null,null,null,null,null,null,null,null,null,null,null,null,null,null,{"$f":"B4","v":"AfyaImara"},{"$f":"B5","v":"AfyaImara County"},{"$f":"B6","v":"AfyaImara Seniors"},{"$f":"B7","v":"AfyaImara Junior"},{"$f":"B8","v":"AfyaImara Executive"}]
[null,null,null,null,null,null,null,null,null,null,null,null,null,null,null,null,"Product","Option","Combination","Inpatient Options","Outpatient Options","Maternity Options","Dental & Optical","OP Limit",null,null,null,1,"a) AFYAIMARA is a Comprehensive Family cover, Providing Inpatient and Outpatient Benefits","a) AFYAIMARA COUNTY is a LOW COST Comprehensive Family cover, Providing Inpatient  & Outpatient Benefits","a) AFYAIMARA SENIORS is a Comprehensive Individual Cover, Providing Inpatient and Optional Outpatient Benefits","a) AFYAIMARA JUNIOR is a Comprehensive CHILDREN COVER, Providing Inpatient and Outpatient benefits.","a) AFYAIMARA EXECUTIVE is a Comprehensive Individual Cover, Providing Inpatient and Optional Outpatient Benefits"]
[null,"AfyaImara",null,null,null,"Limits","Product","Option",null,null,null,null,null,null,"Ages",null,"AfyaImara",1,{"$f":"Q4&R4","v":"AfyaImara1"},500000,50000,40000,"15,000 Each",60000,null,null,null,2,"b) A Waiting Period of 28 Days for Illness Claims and 60 Days for Surgical Claims Applies. Accidents are covered immediately.","b) A Waiting Period of 28 Days for Illness Claims and 60 Days for Surgical Claims Applies. Accidents are covered immediately.","b) Cover is Designed for SENIOR CITIZENS above 65 Years.","b) Cover is Designed for Children, 18 Years and Below.","b) Cover is Designed to offer High Cover Limits, Comprehensive Provider Access Across and WorldWide Cover Scope"]
[null,"AfyaImara County",null,null,null,"Inpatient",{"$f":"QuotationTool!$C$8","v":"AfyaImara"},null," - Select - ",null,"OP Limit",null,null,null,"Child (0 -18 yrs)",null,"AfyaImara",2,{"$f":"Q5&R5","v":"AfyaImara2"},1000000,60000,75000,"30,000 Dental & 25,000 Optical",60000,null,null,null,3,"c) Applicants Above 60 Years are required to submit a medical report in the prescribed manner for eligibility","c) Applicants Above 60 Years are required to submit a medical report in the prescribed manner for eligibility","c) Eligibility is for applicants from 65-80 Years of age. One can then renew cover for LIFE.","c) A Waiting Period of 28 Days for Illness Claims and 60 Days for Surgical Claims Applies. Accidents are covered immediately.","c) Eligibility is for applicants from 0-80 Years of age. One can renew cover until the age of 85 years."]
[null,"AfyaImara Seniors",null,null,null,null,{"$f":"QuotationTool!$C$8","v":"AfyaImara"},1,{"$f":"IFERROR(VLOOKUP(G6&H6,$S$3:$T$24,2,FALSE),\"\")","v":500000},"    Per Family Per Annum",{"$f":"IFERROR(VLOOKUP(G6&H6,$S$3:$X$24,6,FALSE),\"\")","v":60000},null,null,null,"19 yrs - 29 yrs",null,"AfyaImara",3,{"$f":"Q6&R6","v":"AfyaImara3"},3000000,100000,100000,null,100000,null,null,null,4,"d) Eligibility is for applicants from 0-65 Years of age. Existing members can continue renewing in the scheme for life subject to renewal review by Old Mutual General Insurance Company Ltd.","d) Eligibility is for applicants from 0-65 Years of age. One can renew cover until age 70, where they may transition to AfyaImara Seniors","d) Applicants are required to submit a medical report in the prescribed manner for eligibility","d) Application Forms Must be dully filled and Submitted for Processing & Consideration.","d) Applicants Above 60 Years are required to submit a medical report in the prescribed manner for eligibility"]
[null,"AfyaImara Junior",null,null,null,null,{"$f":"QuotationTool!$C$8","v":"AfyaImara"},2,{"$f":"IFERROR(VLOOKUP(G7&H7,$S$3:$T$24,2,FALSE),\"\")","v":1000000},"    Per Family Per Annum",{"$f":"IFERROR(VLOOKUP(G7&H7,$S$3:$X$24,6,FALSE),\"\")","v":60000},null,null,null,"30 yrs - 40 yrs",null,"AfyaImara",4,{"$f":"Q7&R7","v":"AfyaImara4"},5000000,150000,null,null,200000,null,null,null,5,"e) A Co-Pay of KES 500 is applicable in all visits. KES 2,000 Co-Pay is applicable at Aga Khan Hospital - Nairobi, Nairobi Hospital,Pandya Hospital,Karen Hospital,AAR and MP Shah","e) A Co-Pay of KES 200 is applicable in all visits.","e) A Waiting Period of 28 Days for Illness Claims and 60 Days for Surgical Claims Applies. Accidents are covered immediately.","e) Premiums: Payment be paid in full to activate cover, unless a payment plan is approved.","e) A Waiting Period of 28 Days for Illness Claims and 60 Days for Surgical Claims Applies. Accidents are covered immediately."]
[null,"AfyaImara Executive",null,null,null,null,{"$f":"QuotationTool!$C$8","v":"AfyaImara"},3,3000000,"    Per Family Per Annum",100000,null,null,null,"41 yrs - 50 yrs",null,"AfyaImara",5,{"$f":"Q8&R8","v":"AfyaImara5"},10000000,200000,null,null,200000,null,null,null,6,"f) Application Forms Must be dully filled and Submitted for Processing & Consideration.","f) Application Forms Must be dully filled and Submitted for Processing & Consideration.","f) A Co-Pay of Kes 1,000 is applicable in all visits.","f) Services provided under this product can be accessed on the Hospital Network specified under each option below","f) Application Forms Must be dully filled and Submitted for Processing & Consideration."]
[null,null,null,null,null,null,{"$f":"QuotationTool!$C$8","v":"AfyaImara"},4,5000000,"    Per Family Per Annum",200000,null,null,null,"51 yrs - 65 yrs",null,null,null,null,null,null,null,null,null,null,null,null,7,"g) Premiums: Payment be paid in full to activate cover, unless a payment plan is approved.","g) Premiums: Payment be paid in full to activate cover, unless a payment plan is approved.","f) Application Forms Must be dully filled and Submitted for Processing & Consideration.","*Unlimited Panel Option","g) Premiums: Payment be paid in full to activate cover, unless a payment plan is approved."]
[null,"Principal",null,null,null,null,{"$f":"QuotationTool!$C$8","v":"AfyaImara"},5,10000000,"    Per Family Per Annum",200000,null,null,null,"66 Years and Above",null,{"$f":"$B$5","v":"AfyaImara County"},1,{"$f":"Q10&R10","v":"AfyaImara County1"},100000,25000,20000,null,25000,null,null,null,8,"h) Critical Illness lumpsum payment of KES 750,000 is payable upon first positive diagnosis for Cancer, stroke, heart attack, renal/kidney failure, paraplegia or paralysis. This embedded cover  has a 28-day waiting period.","  ","h) Premiums: Payment be paid in full to activate cover, unless a payment plan is approved.","*Gertrude's Hospital Option"]
{"$rows_left_out":54}
{"sheet":"Sheet1","index":2,"n_rows":43,"n_cols":13,"rows_kept":43,"cut":false,"hidden":true,"merged":[]}
[null," - Product - HospitalAccess- Relation - Age Band - ChildNo"]
[]
[]
[]
[]
[]
[]
[]
[]
[]
{"$rows_left_out":34}
{"sheet":"AfyaImaraJunior","index":3,"n_rows":21,"n_cols":18,"rows_kept":21,"cut":false,"hidden":true,"merged":[]}
[null,"INPATIENT",null,null,null,null,null,null,"OP",null,null,null,null,null,null,null,null,"OPTIONS"]
[null,null,null,null,null,null,null,null,null,null,null,null,null,null,null,null,null,"Unlimited Panel"]
[{"$f":"R2","v":"Unlimited Panel"},"Cover limit",500000,1000000,3000000,5000000,null,null,50000,75000,100000,150000,null,null,null,null,null,"Gertrude's Panel"]
[]
[null,"One Child",32953.846153846149,34601.538461538461,37715.676923076928,40355.774307692314,null,null,24990,26239.5,28076.265000000003,30041.603550000003]
[null,"2 Children",51784.615384615368,54373.846153846142,59267.492307692301,67259.623846153845,null,null,46231.5,48543.075000000004,51941.090250000008,55576.966567500014]
[null,"3 Children",68261.538461538454,71674.615384615376,80469.090692307698,90800.492192307691,null,null,46462.657500000001,51108.923250000007,54686.547877500008,58514.606228925011]
[null,"4 Children",82384.615384615376,86503.846153846142,99003.651923076919,110978.37934615387,null,null,46617.533024999997,55941.039629999992,67129.247555999988,80555.097067199982]
[null,"5 Children",98437.846153846127,103359.73846153844,116041.97837076921,131156.26650000003,null,null,46734.076857562497,60754.299914831245,78980.589889280614,102674.7668560648]
[null,"6 Children",116162.3076923077,121970.42307692309,132947.76115384619,151334.15365384618,null,null,46827.545011277631,63217.185765224807,85343.2007830535,115213.32105712223]
{"$rows_left_out":12}
{"sheet":"PricingTable","index":4,"n_rows":121,"n_cols":56,"rows_kept":121,"cut":false,"hidden":true,"merged":[[3,33,3,42],[3,46,3,55]]}
[null,null,null,null,null,1,2,3,4,5,6,7,8,9,10,11,12,13,14,15,16,17,18,19,20,21,22,23,24,25,26]
[null,null,null,null,null," - Product - HospitalAccess- Relation - Age - ChildNo","Inpatient",null,null,null,null,null,null,null,null,"Outpatient",null,null,null,null,null,null,null,null,"Maternity",null,null,null,null,"Dental & Optical"]
[null,null,null,null,null,null,100000,250000,500000,1000000,3000000,5000000,10000000,20000000,null,50000,60000,100000,150000,200000,null,null,null,null,20000,40000,75000,100000,null,"15,000 Each","30,000 Dental & 25,000 Optical",null,null,"Column No.",{"$f":"MATCH(QuotationTool!$D$11,PricingTable!$AI$5:$AP$5,0)+2","v":8},null,null,null,null,null,null,null,null,null,null,null,"Column No.",{"$f":"MATCH(QuotationTool!$D$11,PricingTable!$AV$5:$BC$5,0)+1","v":7}]
[null,null,null,null,null,null,"Inpatient","Inpatient","Inpatient","Inpatient","Inpatient","Inpatient","Inpatient","Inpatient",null,"Outpatient","Outpatient","Outpatient","Outpatient","Outpatient","Outpatient","Outpatient","Outpatient",null,"Maternity","Maternity","Maternity","Maternity",null,"Dental & Optical","Dental & Optical",null,null,"PER FAMILY OP RATES",null,null,null,null,null,null,null,null,null,null,null,null,"PER PERSON OP RATES"]
["AfyaImara","Age Band","Relation","Child No","Hospital Access","Combination",null,null,null,null,null,null,null,null,null,null,null,null,null,null,null,null,null,null,null,null,null,null,null,null,null,null,null,"Family Size","Limit",25000,40000,50000,60000,100000,150000,200000,"N/A",null,null,null,"Family Size","Limit",25000,40000,50000,60000,100000,150000,200000,"N/A"]
[{"$f":"Lists!$B$4","v":"AfyaImara"},"Child (0 -18 yrs)","Child",null,null,{"$f":"A6&E6&C6&B6&D6","v":"AfyaImaraChildChild (0 -18 yrs)"},null,null,{"$f":"AfyaImara!C6","v":13929},{"$f":"AfyaImara!D6","v":17102},{"$f":"AfyaImara!E6","v":26795},{"$f":"AfyaImara!F6","v":28496},{"$f":"AfyaImara!G6","v":31578},null,null,null,null,null,{"$f":"AfyaImara!$D$28","v":26247},{"$f":"AfyaImara!$D$27","v":30732},{"$f":"AfyaImara!$D$26","v":33800},null,null,null,null,null,null,null,null,{"$f":"AfyaImara!$E$38","v":12190},22390,null,{"$f":"A6&AI6","v":"AfyaImaraM"},1,"M",null,null,32934,33266,35226,37892,41512,null,null,null,null,"AfyaImara","M",null,null,32934,33266,35226,37892,41512]
[{"$f":"Lists!$B$4","v":"AfyaImara"},"19 yrs - 29 yrs","Principal",null,null,{"$f":"A7&E7&C7&B7&D7","v":"AfyaImaraPrincipal19 yrs - 29 yrs"},null,null,{"$f":"AfyaImara!C4","v":32256.6875},{"$f":"AfyaImara!D4","v":34283.6875},{"$f":"AfyaImara!E4","v":49171.6875},{"$f":"AfyaImara!F4","v":53024.6875},{"$f":"AfyaImara!G4","v":60534.6875},null,null,null,null,null,{"$f":"AfyaImara!$D$28","v":26247},{"$f":"AfyaImara!$D$27","v":30732},{"$f":"AfyaImara!$D$26","v":33800},null,null,null,null,{"$f":"AfyaImara!$D$34","v":10830},{"$f":"AfyaImara!$D$33","v":17100},{"$f":"AfyaImara!$D$32","v":25650},null,{"$f":"AfyaImara!$E$38","v":12190},22390,null,{"$f":"A7&AI7","v":"AfyaImaraM+1"},2,"M+1",null,null,44986,49269,66533,70452,77987,null,null,null,null,"AfyaImara County","M",9390,10821,11775]
[{"$f":"Lists!$B$4","v":"AfyaImara"},"19 yrs - 29 yrs","Spouse",null,null,"AfyaImaraSpouse19 yrs - 29 yrs",null,null,{"$f":"AfyaImara!C5","v":23900},{"$f":"AfyaImara!D5","v":25582},{"$f":"AfyaImara!E5","v":38516},{"$f":"AfyaImara!F5","v":41671},{"$f":"AfyaImara!G5","v":46337},null,null,null,null,null,{"$f":"AfyaImara!$D$28","v":26247},{"$f":"AfyaImara!$D$27","v":30732},{"$f":"AfyaImara!$D$26","v":33800},null,null,null,null,null,null,null,null,{"$f":"AfyaImara!$E$38","v":12190},22390,null,"AfyaImaraM+2",3,"M+2",null,null,48748,54844,82895,88794,92489,null,null,null,null,"AfyaImara Seniors","M",null,null,null,null,{"$f":"AfyaImaraSeniors!C7","v":94968},{"$f":"AfyaImaraSeniors!D7","v":101270},{"$f":"AfyaImaraSeniors!E7","v":107534}]
[{"$f":"Lists!$B$4","v":"AfyaImara"},"30 yrs - 40 yrs","Principal",null,null,"AfyaImaraPrincipal30 yrs - 40 yrs",null,null,{"$f":"AfyaImara!C8","v":33863},{"$f":"AfyaImara!D8","v":35223},{"$f":"AfyaImara!E8","v":52342},{"$f":"AfyaImara!F8","v":56437},{"$f":"AfyaImara!G8","v":64692},null,null,null,null,null,{"$f":"AfyaImara!$D$28","v":26247},{"$f":"AfyaImara!$D$27","v":30732},{"$f":"AfyaImara!$D$26","v":33800},null,null,null,null,{"$f":"AfyaImara!$D$34","v":10830},{"$f":"AfyaImara!$D$33","v":17100},{"$f":"AfyaImara!$D$32","v":25650},null,{"$f":"AfyaImara!$E$38","v":12190},22390,null,"AfyaImaraM+3",4,"M+3",null,null,48797,55910,98147,106762,111223,null,null,null,null,"AfyaImara Junior","M"]
[{"$f":"Lists!$B$4","v":"AfyaImara"},"30 yrs - 40 yrs","Spouse",null,null,"AfyaImaraSpouse30 yrs - 40 yrs",null,null,{"$f":"AfyaImara!C9","v":25023},{"$f":"AfyaImara!D9","v":26785},{"$f":"AfyaImara!E9","v":40457},{"$f":"AfyaImara!F9","v":43799},{"$f":"AfyaImara!G9","v":48736},null,null,null,null,null,{"$f":"AfyaImara!$D$28","v":26247},{"$f":"AfyaImara!$D$27","v":30732},{"$f":"AfyaImara!$D$26","v":33800},null,null,null,null,null,null,null,null,{"$f":"AfyaImara!$E$38","v":12190},22390,null,"AfyaImaraM+4",5,"M+4",null,null,48846,57804,98245,121829,126966,null,null,null,null,"AfyaImara Executive","M"]
{"$rows_left_out":112}
{"sheet":"BenefitsSchedule","index":5,"n_rows":51,"n_cols":11,"rows_kept":51,"cut":false,"hidden":false,"merged":[[33,0,33,1],[24,0,24,1],[25,0,25,1],[26,0,26,1],[27,0,27,1],[28,0,28,1],[29,0,29,1],[30,0,30,1],[31,0,31,1],[32,0,32,1],[3,10,4,10],[8,0,8,1],[9,0,9,1],[23,0,23,1],[12,0,12,1],[13,0,13,1],[14,0,14,1],[15,0,15,1],[16,0,16,1],[17,0,17,1],[18,0,18,1],[19,0,19,1],[20,0,20,1],[21,0,21,1],[22,0,22,1],[3,1,4,2],[44,0,44,2],[39,0,39,1],[3,0,4,0],[0,2,2,2],[5,0,6,2],[10,0,10,1],[11,0,11,1],[7,0,7,2],[41,0,41,1],[42,0,42,1],[34,0,34,1],[35,0,35,1],[36,0,36,1],[37,0,37,1],[38,0,38,1],[40,0,40,1]]}
[null,null,"[ Page 2/2 of Quotation ] "]
[]
[]
[{"$f":"QuotationTool!C5","v":"ABSOLOM IRUNGU"},{"$f":"QuotationTool!C8&\"  -  Health Insurance QUOTATION\"","v":"AfyaImara  -  Health Insurance QUOTATION"}]
[]
["Benefits Schedule"]
[]
["Inpatient"]
[{"$f":"IFERROR(VLOOKUP(QuotationTool!$C$8&QuotationTool!$C$10&BenefitsSchedule!K9,BenefitsLookup!$A:$E,5,FALSE),\"\")","v":"Overall Limit"},null,{"$f":"IFERROR(VLOOKUP(QuotationTool!$C$8&QuotationTool!$C$10&K9,BenefitsLookup!$A:$M,MATCH(QuotationTool!$D$10,BenefitsLookup!$A$3:$M$3,0),FALSE),\"\")","v":10000000},null,null,null,null,null,null,"Inpatient",1]
[{"$f":"IFERROR(VLOOKUP(QuotationTool!$C$8&QuotationTool!$C$10&BenefitsSchedule!K10,BenefitsLookup!$A:$E,5,FALSE),\"\")","v":"Bed"},null,{"$f":"IFERROR(VLOOKUP(QuotationTool!$C$8&QuotationTool!$C$10&K10,BenefitsLookup!$A:$M,MATCH(QuotationTool!$D$10,BenefitsLookup!$A$3:$M$3,0),FALSE),\"\")","v":"En Suite / Max Kes 26,000"},null,null,null,null,null,null,"Inpatient",2]
{"$rows_left_out":42}
{"sheet":"BenefitsLookup","index":6,"n_rows":131,"n_cols":30,"rows_kept":131,"cut":false,"hidden":true,"merged":[]}
[]
[null,"Benefit Table",null,null,null,"Inpatient",null,null,null,null,null,null,null,null,"Outpatient",null,null,null,null,null,null,null,null,"Maternity",null,null,null,null,"Dental & Optical"]
["Combination","Product","Benefit","Option","Benefit",100000,250000,500000,1000000,3000000,5000000,10000000,20000000,null,10000,25000,50000,60000,100000,150000,200000,250000,null,20000,40000,75000,100000,null,"15,000 Each","30,000 Dental & 25,000 Optical"]
[{"$f":"B4&C4&D4","v":"AfyaImaraInpatient1"},{"$f":"Lists!$B$4","v":"AfyaImara"},"Inpatient",1,"Overall Limit",null,null,500000,1000000,3000000,5000000,10000000]
[{"$f":"B5&C5&D5","v":"AfyaImaraInpatient2"},{"$f":"Lists!$B$4","v":"AfyaImara"},"Inpatient",2,"Bed",null,null,"General Ward / Max Kes 8,000","General Ward / Max Kes 10,000","Standard Private Room / Max Kes 18,000","Standard Private Room / Max Kes 18,000","En Suite / Max Kes 26,000"]
["AfyaImaraInpatient3",{"$f":"Lists!$B$4","v":"AfyaImara"},"Inpatient",3,"Lodger Fee for Accompanying Parent/Guardian ",null,null,"12 Years","12 Years","12 Years","12 Years","12 Years"]
["AfyaImaraInpatient4",{"$f":"Lists!$B$4","v":"AfyaImara"},"Inpatient",4,"Emergency Evacuation Within East Africa",null,null,"Road Ambulance","Road Ambulance","Road & Air Ambulance","Road & Air Ambulance","Road & Air Ambulance"]
["AfyaImaraInpatient5",{"$f":"Lists!$B$4","v":"AfyaImara"},"Inpatient",5,"Accidents",null,null,"To overall Limit","To overall Limit","To overall Limit","To overall Limit","To overall Limit"]
["AfyaImaraInpatient6",{"$f":"Lists!$B$4","v":"AfyaImara"},"Inpatient",6,"Newly Diagnosed Chronic illnesses",null,null,350000,700000,2000000,2500000,3500000]
["AfyaImaraInpatient7",{"$f":"Lists!$B$4","v":"AfyaImara"},"Inpatient",7,"Chronic, Pre-existing illnesses, Congenital Conditions & HIV/AIDS ",null,null,250000,400000,700000,800000,1000000]
{"$rows_left_out":122}
{"sheet":"AfyaImara","index":7,"n_rows":39,"n_cols":16,"rows_kept":39,"cut":false,"hidden":true,"merged":[[0,2,0,6]]}
[null,null,"INPATIENT",null,null,null,null,null,null,"Outpatient Rates"]
[null,"AfyaImara Rates",null,null,null,null,null,"OP Option","Family Size","Limit",50000,60000,100000,150000,200000,"N/A"]
[null,"19 yrs - 29 yrs",500000,1000000,3000000,5000000,10000000,null,1,"M",32934,33266,35226,37892,41512]
[null,"Principal Member",32256.6875,34283.6875,49171.6875,53024.6875,60534.6875,"Yes",2,"M+1",44986,49269,66533,70452,77987]
[null,"Spouse",23900,25582,38516,41671,46337,"No",3,"M+2",48748,54844,82895,88794,92489]
[null,"Child (0 -18 yrs)",13929,17102,26795,28496,31578,null,4,"M+3",48797,55910,98147,106762,111223]
[null,"30 yrs - 40 yrs",null,null,null,null,null,null,5,"M+4",48846,57804,98245,121829,126966]
[null,"Principal Member",33863,35223,52342,56437,64692,null,6,"M+5",49339,58095,99028,136895,142709]
[null,"Spouse",25023,26785,40457,43799,48736,null,7,"M+6",49837,58387,99282,148202,157539]
[null,"Child (0 -18 yrs)",13929,17102,26795,28496,31578]
{"$rows_left_out":30}
{"sheet":"AfyaImaraCounty","index":8,"n_rows":29,"n_cols":14,"rows_kept":29,"cut":false,"hidden":true,"merged":[]}
[]
[null,"AfyaImara County Rates",null,null,null,null,null,null,"Family Size","Limit",25000,40000,50000,"N/A"]
[null,"19 yrs. - 29 yrs.",100000,250000,500000,1000000,null,null,1,"M",9390,10821,11775]
[null,"Principal Member",11184,14833,23189,26908,null,null,2,"M+1",10841,18050,22856]
[null,"Spouse",9438,11223,17818,20488,null,null,3,"M+2",15921,22120,26252]
[null,"Child (0 -18 yrs.)",5438,6725,10552,13856,null,null,4,"M+3",21002,26647,30411]
[null,"30 yrs. - 40 yrs.",null,null,null,null,null,null,5,"M+4",23856,30788,35408]
[null,"Principal Member",11752,15471,24203,28068,null,null,6,"M+5",24603,34661,41366]
[null,"Spouse",9846,11681,18638,21428]
[null,"Child (0 -18 yrs.)",5438,6725,10552,13856]
{"$rows_left_out":20}
{"sheet":"AfyaImaraSeniors","index":9,"n_rows":11,"n_cols":7,"rows_kept":11,"cut":false,"hidden":true,"merged":[]}
[]
[null,"AfyaImara Seniors Rates"]
[null,"Inpatient Per Person",500000,1000000,3000000,5000000,10000000]
[null,"Rate Per Person",116352,132299,178535,206231,229049]
[]
[null,"Outpatient Per Person",100000,150000,200000]
[null,"Rate Per Person",94968,101270,107534]
[]
[null,"Dental and Optical Rates"]
[null,"Limit","Dental 20,000","Optical 20,000"]
{"$rows_left_out":2}
{"sheet":"AfyaImaraExecutive","index":10,"n_rows":32,"n_cols":5,"rows_kept":32,"cut":false,"hidden":true,"merged":[[1,3,1,4]]}
[]
[null,null,null,"Annual Cover limits"]
[null,"Age Band","Beneficiary",10000000,20000000]
[]
[null,"19 yrs - 29 yrs","Principal Member",222424,259199]
[null,null,"Spouse",195174,228056]
[null,null,"Child (0 months to 18 yrs)",97360,111268]
[]
[null,"30 yrs - 40 yrs","Principal Member",231972,270111]
[null,null,"Spouse",203059,237067]
{"$rows_left_out":22}